particular-n
type: LexicalEntry
canonical form: particular
sense: 06763856-n
part of speech: noun

particular proposition-n
type: LexicalEntry
canonical form: particular proposition
sense: 06763856-n
part of speech: noun

06763856-n
type: LexicalConcept
in scheme: en-word.net
definition: (logic) a proposition that asserts something about some (but not all) members of a class
ili: i71971
lexfile: noun.communication
part of speech: noun
domain topic: 06173467-n
hypernym: 06763518-n