proposition-n
type: LexicalEntry
canonical form: proposition
sense: 06763518-n
part of speech: noun

06763518-n
type: LexicalConcept
in scheme: en-word.net
definition: (logic) a statement that affirms or denies something and is either true or false
ili: i71970
lexfile: noun.communication
part of speech: noun
domain topic: 06173467-n
hypernym: 06735202-n
mero part: 06764688-n