program-n
type: LexicalEntry
canonical form: program
sense: 06761180-n
part of speech: noun

programme-n
type: LexicalEntry
canonical form: programme
sense: 06761180-n
part of speech: noun

06761180-n
type: LexicalConcept
in scheme: en-word.net
definition: an announcement of the events that will occur as part of a theatrical or sporting event
example: you can't tell the players without a program
ili: i71957
lexfile: noun.communication
part of speech: noun
hypernym: 06759293-n