contract-n
type: LexicalEntry
canonical form: contract
sense: 06750143-n
part of speech: noun

declaration-n
type: LexicalEntry
canonical form: declaration
sense: 06750143-n
part of speech: noun

06750143-n
type: LexicalConcept
in scheme: en-word.net
definition: (contract bridge) the highest bid becomes the contract setting the number of tricks that the bidder must make
ili: i71904
lexfile: noun.communication
part of speech: noun
domain topic: 06532935-n
hypernym: 06749861-n