bid-n
type: LexicalEntry
canonical form: bid
sense: 06749861-n
part of speech: noun

bidding-n
type: LexicalEntry
canonical form: bidding
sense: 06749861-n
part of speech: noun

06749861-n
type: LexicalConcept
in scheme: en-word.net
definition: (bridge) the number of tricks a bridge player is willing to contract to make
ili: i71903
lexfile: noun.communication
part of speech: noun
domain topic: 00491580-n
hypernym: 06735202-n