witness-n
type: LexicalEntry
canonical form: witness
sense: 06747451-n
part of speech: noun

06747451-n
type: LexicalConcept
in scheme: en-word.net
definition: testimony by word or deed to your religious faith
ili: i71890
lexfile: noun.communication
part of speech: noun
hypernym: 06747216-n