exhibit-n
type: LexicalEntry
canonical form: exhibit
sense: 06747071-n
part of speech: noun

06747071-n
type: LexicalConcept
in scheme: en-word.net
definition: an object or statement produced before a court of law and referred to while giving evidence
ili: i71888
lexfile: noun.communication
part of speech: noun
hypernym: 06746688-n