specification-n
type: LexicalEntry
canonical form: specification
sense: 06737816-n
part of speech: noun

spec-n
type: LexicalEntry
canonical form: spec
sense: 06737816-n
part of speech: noun

06737816-n
type: LexicalConcept
in scheme: en-word.net
definition: a detailed description of design criteria for a piece of work
ili: i71843
lexfile: noun.communication
part of speech: noun
hypernym: 06737512-n