statement-n
type: LexicalEntry
canonical form: statement
sense: 06735202-n
part of speech: noun

06735202-n
type: LexicalConcept
in scheme: en-word.net
definition: a message that is stated or declared; a communication (oral or written) setting forth particulars or facts etc
example: according to his statement he was in London on that day
ili: i71833
lexfile: noun.communication
part of speech: noun
hypernym: 06611268-n