interpolation-n
type: LexicalEntry
canonical form: interpolation
sense: 06734935-n
part of speech: noun

insertion-n
type: LexicalEntry
canonical form: insertion
sense: 06734935-n
part of speech: noun

06734935-n
type: LexicalConcept
in scheme: en-word.net
definition: a message (spoken or written) that is introduced or inserted
example: with the help of his friend's interpolations his story was eventually told
example: with many insertions in the margins
ili: i71832
lexfile: noun.communication
part of speech: noun
hypernym: 06611268-n