disapprobation-n
type: LexicalEntry
canonical form: disapprobation
sense: 06722631-n
part of speech: noun

condemnation-n
type: LexicalEntry
canonical form: condemnation
sense: 06722631-n
part of speech: noun

06722631-n
type: LexicalConcept
in scheme: en-word.net
definition: an expression of strong disapproval; pronouncing as wrong or morally culpable
example: his uncompromising condemnation of racism
ili: i71767
lexfile: noun.communication
part of speech: noun
hypernym: 06722472-n