tribute-n
type: LexicalEntry
canonical form: tribute
sense: 06709958-n
part of speech: noun

testimonial-n
type: LexicalEntry
canonical form: testimonial
sense: 06709958-n
part of speech: noun

06709958-n
type: LexicalConcept
in scheme: en-word.net
definition: something given or done as an expression of esteem
ili: i71680
lexfile: noun.communication
part of speech: noun
hypernym: 06699481-n