guarantee-n
type: LexicalEntry
canonical form: guarantee
sense: 06698919-n
part of speech: noun

06698919-n
type: LexicalConcept
in scheme: en-word.net
definition: an unconditional commitment that something will happen or that something is true
example: there is no guarantee that they are not lying
ili: i71622
lexfile: noun.communication
part of speech: noun
hypernym: 07242432-n