offset-n
type: LexicalEntry
canonical form: offset
sense: 06693315-n
part of speech: noun

offset printing-n
type: LexicalEntry
canonical form: offset printing
sense: 06693315-n
part of speech: noun

06693315-n
type: LexicalConcept
in scheme: en-word.net
definition: a plate makes an inked impression on a rubber-blanketed cylinder, which in turn transfers it to the paper
ili: i71590
lexfile: noun.communication
part of speech: noun
hypernym: 06690047-n