argument-n
type: LexicalEntry
canonical form: argument
sense: 06661469-n
part of speech: noun

statement-n
type: LexicalEntry
canonical form: statement
sense: 06661469-n
part of speech: noun

06661469-n
type: LexicalConcept
in scheme: en-word.net
definition: a fact or assertion offered as evidence that something is true
example: it was a strong argument that his hypothesis was true
ili: i71419
lexfile: noun.communication
part of speech: noun
hypernym: 06656171-n