record-n
type: LexicalEntry
canonical form: record
sense: 06659969-n
part of speech: noun

06659969-n
type: LexicalConcept
in scheme: en-word.net
definition: anything (such as a document or a phonograph record or a photograph) providing permanent evidence of or information about past events
example: the film provided a valuable record of stage techniques
ili: i71411
lexfile: noun.communication
part of speech: noun
domain topic: 00905257-n
hypernym: 06656171-n