trace-n
type: LexicalEntry
canonical form: trace
sense: 06659799-n
part of speech: noun

06659799-n
type: LexicalConcept
in scheme: en-word.net
definition: a visible mark (as a footprint) left by the passage of person or animal or vehicle
ili: i71410
lexfile: noun.communication
part of speech: noun
hypernym: 06811608-n