loop-n
type: LexicalEntry
canonical form: loop
sense: 06657586-n
part of speech: noun

06657586-n
type: LexicalConcept
in scheme: en-word.net
definition: the basic pattern of the human fingerprint
ili: i71398
lexfile: noun.communication
part of speech: noun
hypernym: 06657156-n