basics-n
type: LexicalEntry
canonical form: basics
sense: 06652212-n
part of speech: noun

rudiments-n
type: LexicalEntry
canonical form: rudiments
sense: 06652212-n
part of speech: noun

06652212-n
type: LexicalConcept
in scheme: en-word.net
definition: a statement of fundamental facts or principles
ili: i71371
lexfile: noun.communication
part of speech: noun
hypernym: 06648784-n