edition-n
type: LexicalEntry
canonical form: edition
sense: 06602727-n
part of speech: noun

06602727-n
type: LexicalConcept
in scheme: en-word.net
definition: the form in which a text (especially a printed book) is published
ili: i71088
lexfile: noun.communication
part of speech: noun
hypernym: 06602491-n