translator-n
type: LexicalEntry
canonical form: translator
sense: 06593444-n
part of speech: noun

translating program-n
type: LexicalEntry
canonical form: translating program
sense: 06593444-n
part of speech: noun

06593444-n
type: LexicalConcept
in scheme: en-word.net
definition: a program that translates one programming language into another
ili: i71042
lexfile: noun.communication
part of speech: noun
hypernym: 06581154-n