plug-in-n
type: LexicalEntry
canonical form: plug-in
sense: 06578832-n
part of speech: noun

add-on-n
type: LexicalEntry
canonical form: add-on
sense: 06578832-n
part of speech: noun

06578832-n
type: LexicalConcept
in scheme: en-word.net
definition: a software module that extends or enhances the capabilities of an existing application
lexfile: noun.communication
part of speech: noun
hypernym: 06578068-n