execution-n
type: LexicalEntry
canonical form: execution
sense: 06565837-n
part of speech: noun

writ of execution-n
type: LexicalEntry
canonical form: writ of execution
sense: 06565837-n
part of speech: noun

06565837-n
type: LexicalConcept
in scheme: en-word.net
definition: a routine court order that attempts to enforce the judgment that has been granted to a plaintiff by authorizing a sheriff to carry it out
ili: i70904
lexfile: noun.communication
part of speech: noun
domain topic: 08458195-n
hypernym: 06551493-n