acquittance-n
type: LexicalEntry
canonical form: acquittance
sense: 06564805-n
part of speech: noun

release-n
type: LexicalEntry
canonical form: release
sense: 06564805-n
part of speech: noun

06564805-n
type: LexicalConcept
in scheme: en-word.net
definition: a legal document evidencing the discharge of a debt or obligation
ili: i70900
lexfile: noun.communication
part of speech: noun
domain topic: 08458195-n
hypernym: 06491336-n