occupation license-n
type: LexicalEntry
canonical form: occupation license
sense: 06563489-n
part of speech: noun

occupation licence-n
type: LexicalEntry
canonical form: occupation licence
sense: 06563489-n
part of speech: noun

06563489-n
type: LexicalConcept
in scheme: en-word.net
definition: a license to pursue a particular occupation
ili: i70893
lexfile: noun.communication
part of speech: noun
hypernym: 06561652-n