commutation-n
type: LexicalEntry
canonical form: commutation
sense: 06560489-n
part of speech: noun

06560489-n
type: LexicalConcept
in scheme: en-word.net
definition: a warrant substituting a lesser punishment for a greater one
ili: i70876
lexfile: noun.communication
part of speech: noun
domain topic: 08458195-n
hypernym: 06559050-n