warrant-n
type: LexicalEntry
canonical form: warrant
sense: 06559050-n
part of speech: noun

06559050-n
type: LexicalConcept
in scheme: en-word.net
definition: a writ from a court commanding police to perform specified acts
ili: i70869
lexfile: noun.communication
part of speech: noun
domain topic: 08458195-n
hypernym: 06564975-n