will-n
type: LexicalEntry
canonical form: will
sense: 06556133-n
part of speech: noun

testament-n
type: LexicalEntry
canonical form: testament
sense: 06556133-n
part of speech: noun

06556133-n
type: LexicalConcept
in scheme: en-word.net
definition: a legal document declaring a person's wishes regarding the disposal of their property when they die
ili: i70854
lexfile: noun.communication
part of speech: noun
domain topic: 08458195-n
hypernym: 06491336-n
mero part: 06556648-n