nullity-n
type: LexicalEntry
canonical form: nullity
sense: 06544754-n
part of speech: noun

06544754-n
type: LexicalConcept
in scheme: en-word.net
definition: something that is null (especially an enactment that has no legal validity)
ili: i70797
lexfile: noun.communication
part of speech: noun
hypernym: 06544086-n