indent-n
type: LexicalEntry
canonical form: indent
sense: 06541870-n
part of speech: noun

06541870-n
type: LexicalConcept
in scheme: en-word.net
definition: an order for goods to be exported or imported
ili: i70781
lexfile: noun.communication
part of speech: noun
domain region: 08879115-n
hypernym: 06541210-n