conspiracy-n
type: LexicalEntry
canonical form: conspiracy
sense: 06536926-n
part of speech: noun

confederacy-n
type: LexicalEntry
canonical form: confederacy
sense: 06536926-n
part of speech: noun

06536926-n
type: LexicalConcept
in scheme: en-word.net
definition: a secret agreement between two or more people to perform an unlawful act
ili: i70755
lexfile: noun.communication
part of speech: noun
hypernym: 06783066-n