stub-n
type: LexicalEntry
canonical form: stub
sense: 06532420-n
part of speech: noun

ticket stub-n
type: LexicalEntry
canonical form: ticket stub
sense: 06532420-n
part of speech: noun

06532420-n
type: LexicalConcept
in scheme: en-word.net
definition: a torn part of a ticket returned to the holder as a receipt
ili: i70733
lexfile: noun.communication
part of speech: noun
hypernym: 06532213-n