transfer-n
type: LexicalEntry
canonical form: transfer
sense: 06531471-n
part of speech: noun

06531471-n
type: LexicalConcept
in scheme: en-word.net
definition: a ticket that allows a passenger to change conveyances
ili: i70726
lexfile: noun.communication
part of speech: noun
hypernym: 06530710-n