resignation-n
type: LexicalEntry
canonical form: resignation
sense: 06523551-n
part of speech: noun

06523551-n
type: LexicalConcept
in scheme: en-word.net
definition: a formal document giving notice of your intention to resign
example: he submitted his resignation as of next month
ili: i70679
lexfile: noun.communication
part of speech: noun
hypernym: 06481744-n