posting-n
type: LexicalEntry
canonical form: posting
sense: 06506364-n
part of speech: noun

06506364-n
type: LexicalConcept
in scheme: en-word.net
definition: (bookkeeping) a listing on the company's records
example: the posting was made in the cash account
ili: i70585
lexfile: noun.communication
part of speech: noun
domain topic: 00620470-n
hypernym: 06492991-n