inventory-n
type: LexicalEntry
canonical form: inventory
sense: 06504655-n
part of speech: noun

stock list-n
type: LexicalEntry
canonical form: stock list
sense: 06504655-n
part of speech: noun

06504655-n
type: LexicalConcept
in scheme: en-word.net
definition: a detailed list of all the items in stock
ili: i70575
lexfile: noun.communication
part of speech: noun
hypernym: 06492991-n
mero part: 06494750-n