item-n
type: LexicalEntry
canonical form: item
sense: 06494090-n
part of speech: noun

point-n
type: LexicalEntry
canonical form: point
sense: 06494090-n
part of speech: noun

06494090-n
type: LexicalConcept
in scheme: en-word.net
definition: a distinct part that can be specified separately in a group of things that could be enumerated on a list
example: he noticed an item in the New York Times
example: she had several items on her shopping list
example: the main point on the agenda was taken up first
ili: i70514
lexfile: noun.communication
part of speech: noun
hypernym: 13831419-n