compendium-n
type: LexicalEntry
canonical form: compendium
sense: 06479667-n
part of speech: noun

06479667-n
type: LexicalConcept
in scheme: en-word.net
definition: a concise but comprehensive summary of a larger work
ili: i70446
lexfile: noun.communication
part of speech: noun
hypernym: 06478678-n