Hosea-n
type: LexicalEntry
canonical form: Hosea
sense: 06450923-n
part of speech: noun

Book of Hosea-n
type: LexicalEntry
canonical form: Book of Hosea
sense: 06450923-n
part of speech: noun

06450923-n
type: LexicalConcept
in scheme: en-word.net
definition: an Old Testament book telling Hosea's prophecies
ili: i70323
lexfile: noun.communication
part of speech: noun
instance hypernym: 06406508-n