translation-n
type: LexicalEntry
canonical form: translation
sense: 06441153-n
part of speech: noun

06441153-n
type: LexicalConcept
in scheme: en-word.net
definition: rewording something in less technical terminology
ili: i70284
lexfile: noun.communication
part of speech: noun
hypernym: 06440986-n