tract-n
type: LexicalEntry
canonical form: tract
sense: 06420933-n
part of speech: noun

pamphlet-n
type: LexicalEntry
canonical form: pamphlet
sense: 06420933-n
part of speech: noun

06420933-n
type: LexicalConcept
in scheme: en-word.net
definition: a brief treatise on a subject of interest; published in the form of a booklet
ili: i70169
lexfile: noun.communication
part of speech: noun
hypernym: 06420294-n