adaptation-n
type: LexicalEntry
canonical form: adaptation
sense: 06420422-n
part of speech: noun

version-n
type: LexicalEntry
canonical form: version
sense: 06420422-n
part of speech: noun

06420422-n
type: LexicalConcept
in scheme: en-word.net
definition: a written work (as a novel) that has been recast in a new form
example: the play is an adaptation of a short novel
ili: i70166
lexfile: noun.communication
part of speech: noun
hypernym: 06374360-n