passage-n
type: LexicalEntry
canonical form: passage
sense: 06411914-n
part of speech: noun

06411914-n
type: LexicalConcept
in scheme: en-word.net
definition: a section of text; particularly a section of medium length
ili: i70116
lexfile: noun.communication
part of speech: noun
hypernym: 06403644-n