narration-n
type: LexicalEntry
canonical form: narration
sense: 06408950-n
part of speech: noun

06408950-n
type: LexicalConcept
in scheme: en-word.net
definition: (rhetoric) the second section of an oration in which the facts are set forth
ili: i70100
lexfile: noun.communication
part of speech: noun
domain topic: 06180214-n
hypernym: 06403644-n