by-line-n
type: LexicalEntry
canonical form: by-line
sense: 06360255-n
part of speech: noun

credit line-n
type: LexicalEntry
canonical form: credit line
sense: 06360255-n
part of speech: noun

06360255-n
type: LexicalConcept
in scheme: en-word.net
definition: a line giving the name of the writer of a story or article
ili: i69846
lexfile: noun.communication
part of speech: noun
hypernym: 07025650-n
mero part: 06350114-n