retroversion-n
type: LexicalEntry
canonical form: retroversion
sense: 06358758-n
part of speech: noun

06358758-n
type: LexicalConcept
in scheme: en-word.net
definition: translation back into the original language
example: the teacher translated Latin texts into English which he gave to his students for retroversion
ili: i69838
lexfile: noun.communication
part of speech: noun
hypernym: 06548380-n