title-n
type: LexicalEntry
canonical form: title
sense: 06357831-n
part of speech: noun

06357831-n
type: LexicalConcept
in scheme: en-word.net
definition: a general or descriptive heading for a section of a written work
example: the novel had chapter titles
ili: i69832
lexfile: noun.communication
part of speech: noun
hypernym: 06356690-n