instrumental role-n
type: LexicalEntry
canonical form: instrumental role
sense: 06343724-n
part of speech: noun

instrument-n
type: LexicalEntry
canonical form: instrument
sense: 06343724-n
part of speech: noun

06343724-n
type: LexicalConcept
in scheme: en-word.net
definition: the semantic role of the entity (usually inanimate) that the agent uses to perform an action or start a process
ili: i69756
lexfile: noun.communication
part of speech: noun
hypernym: 06342796-n