agentive role-n
type: LexicalEntry
canonical form: agentive role
sense: 06343357-n
part of speech: noun

agent-n
type: LexicalEntry
canonical form: agent
sense: 06343357-n
part of speech: noun

06343357-n
type: LexicalConcept
in scheme: en-word.net
definition: the semantic role of the animate entity that instigates or causes the happening denoted by the verb in the clause
ili: i69754
lexfile: noun.communication
part of speech: noun
hypernym: 06342796-n