person-n
type: LexicalEntry
canonical form: person
sense: 06337790-n
part of speech: noun

06337790-n
type: LexicalConcept
in scheme: en-word.net
definition: a grammatical category used in the classification of pronouns, possessive determiners, and verb forms according to whether they indicate the speaker, the addressee, or a third party
example: stop talking about yourself in the third person
ili: i69726
lexfile: noun.communication
part of speech: noun
hypernym: 06320373-n